DST Short Status Test, 1000-0146, 1000-0141

Help!

I have a Dell Inspirion E1505 I purchased in the summer of 2006. Last year, I put in a new hard drive, doubled the amount of memory, replaced the keyboard, and put in a new CD/DVD drive. It's currently running XP.

Lately, especially with the wireless, my computer has been acting funny. Slow, very slow to open up new tabs in Internet Explorer. The other day it was SO slow I decided to restart it and see if that helped. It started up fine, but when I tried pressing "Start" to open back up Internet Explorer it was frozen. At this point I decided to reboot and run a diagnostic. This is what I got:

DST Short Status Test
Test results: Fail
Error code 1000-0146
Message: Unit0: IDE status failed
Status byte=64 Control code=1
Message=no additional sense information

Test results: Fail
Error code: 1000-0141
Message: no drive detected


I haven't done anything since I got that result (as in, my computer is still on and on this diagnostics page)

What should I do?
View complete forum thread


Related threads

Dell I6000 - DST Short Status Test failed?

Alright. So last night my laptop started blue screening when booting Windows. I ran a diagnostics test and found that the DST Short Status Test fails. The general consensus I've found on google says that this marks HDD failure. However, I have no ...

Having Problems with Dell Latitude. DST Short Status Failure.?

... an error in the software. Please report this problem as : load needed DLLs for kernel. When I run a diagnostics on it, it says that the DST short test error 1000-0146 DST Log contains previous errors Wont let me log into my computer. Just says ...

Laptop Error: Diagnostic Test

When I ran the diagnostic test on my Dell laptop, one of the parts failed. DST Short Status Test Unit 4: Drive Self Test Failed - Status Byte: 70 So this basically means that something is wrong with my hard drive? It seems to be working fine, though. The only ...

Missing or corrupt file

I have a Dell D610 and on the startup I get the WINDOWSSYSTEM32CONFIGSYSTEM and then I ran a diagnostic and got a - DST Short Status Test Error Code 1000-0146 Msg: Unit 0:IDE Status failed Status Byte = 64 Control Code = 1 Msg = NO additional Sense Information

Why does my Dell Inspiron 6400 Stops,then Blue screen appears then asked for rebooting?..?

... appears ... then restarts automatically , When i reboot it everything's result has passed but one thing didn't ... Here's what failed ... --DST Short Status Test-- Test Result:Fail Error Code:1000-0146 MSG : Unit 0 : IDE Status failed . Status byte = 64 Control Code = 1 MSG ...

Hard Drive Failure - Coincidence?

... details about the failure: The hard drives make a loud clicking noise, and one computer which ran a diagnostic test failed the DST Short Status Test. It gave the following error message: Block 35620817: Uncorrectable data error or media is write protected. ...

Pretty sure it's a virus...

... in a "Pre-boot System Assessment Build 3017" and getting an error: "DST Short Status Test" Test Results: Fail Error Code: 1000-0142 Msg: Unit 4: Drive Self Test failed. Status byte = 79 Currently the system is telling me to insert my Dell "Drivers and ...

Do I have a virus?

... I was prepared for when I booted into set-up was the diagnostics option. It ran this test: Pre Boot assessment test build 3012 Here are the results. FAILED DST Short Status test error code: 1000 - 0142 Msg:Unit 4: Drive test failed. Status byte = 79

How to boot my computer?

... a Dell inspiron 8600 series. I tried out every option to get it working and then I got to the last one and it tested it's self.It passed the first couple of tests, but when it got to the DST short status test it FAILED. Then immediatly after that an error occured and it started ...

Start DST Short Test - no hard drive detected - error 1000-0141

Suddenly my dell latitude d620 stopped working. Message when I boot the laptop is "Start DST Short Test - no hard drive detected - error 1000-0141". I removed the hard drive (hitachigst travelstar) and placed another one from another laptop. The laptop worked ...

Please Help! : DST Short Test - 'Fail' - code 1000-0146???

... reboot, I hit the F12 key to run the diagnostics and the error code that I got was "DST Short Test - 'Fail' - code 1000-0146" "msg: Unit 2: DST Log contains previous error", but I can't get into the thing to try to figure out the problem, I'm frozen ...

blank monitor dst short test error code 1000 - 0146

... just not responding. i did a diagnostic test on the computer and got the error message dst short test error code 1000 - 0146. What does this mean? is this why my monitor won't respond. please any help would be appreciated. i just want my laptop to work again.

DST short test error code 1000-0146

I have an DST Short Test error code 1000-0146 It wont run in safe mode or any mode. I need help plz. Thank you.

DST Short Test Fail, but ChkDsk Pass?

... error code of "0142 DST Short Test Fail." I ran ... recieved this error code, "0146 DST Short Test Fail." ... April. Is my hard drive really dying again? Or is my diagnostic test lying to me? (My last hard drive, which had good cause to fail, also gave me the 0142/0146 error messages, but in that instance ...

Dell Inspiron 6000 Failed DST Short Test

... ). I tried the F12 key and was able to do the diagnostics test. The computer passed every test except the DST. The test showed the following information:Device: Hard Drive Test: Start DST Short Test Status: Error Detected Test Results: Fail Error Code; 1000-0141 Msg: No drive detected I read ...

Harddrive died, new one doesn't work : HELP ! French student about nervous breakdown

... do anything. I ran a diagnostic. Result : DST SHORT STATUS : FAILED ERROR CODE : 1000-0142 MSG : UNIT 4 : DRIVE SELF TEST FAILED STATUS BYTE = 88 I went on the internet, read forums ... "starts DST Short test" error code:1000-0141. MSG: No drive detected The message ...

DST Short test Failed help plz?

... safe mode the blue screen kept coming up... so i ran diognistics and it told me..... DST Short Test Failed Error code 1000-146 unit 0: DST log contains previous errors. So i reinstalled windows xp, and after 3 tries i finally got it ...

HD Smart Short Self Test failed

... 2013 9:01:39 PM The device reported the following status: The previous self-test completed having the read ... that way and everything passed accept DST short Test on the same hard drive and it popped ... 101258 Attached Files Test Event Logs - Default ...

M1210 HDD DST Short Test Fail

... 3 of the sectors on my hdd (100GB 7X00rpm) have gone bad. I ran the Dell diagnostics partition and got the following error: "DST Short Test: Fail Error 2000-0146" From the little bit o' Googling that I've done, I realize this means that the hard drive is ...

SMART Short Self Test fail

Hi all, I got my Compaq computer just 1 year ago. Recently, the monthly maintenence test ran and SMART Short Self Test failed(Failed (Error code: HD521-2W). What does this mean? I went online and many posts said that it meant my Hard drive is ...

Question: Failed Targeted Read Test and SMART Short Self Test

Hi, I recently ran a scheduled diagnostic test of my PC with the manufacturer's diagnostic software. I received two error messages and ... the second was Failed (Error code: WHD16-T57). The apply to Targeted Read test and Smart Short Self Test respectively. So I ran Chkdsk for the C: drive and ...

DST short test failed on dell latitude d500, help?

... to reboot but it kept blue screening. It wont let me use safe mode. I tried hitting f12 and running the diagnostics from the beginning but the DST Short Test failed and my laptop started making weird Nintendo sounds. How do I fix this?

dell laptop error code?

... to shut down. i tried running it in safe mode but same thing. i ran a diagnostic test and everything passed except the DST Short Status failed and beeped. a pop up said to boot from the drivers and utility disk but i don't have it. error code is 1000-0142 any suggestions?

How do i fix windows dst short test failed.?

I have a dell studio 1535, and when i turn it on it goes into a "boot-loop" and will not start up. It did pre-boot system test and it said Error DST Short Test Failed. Someone please help!!!